running 1 test test deferred_work::tests::forged_running_token_cannot_credit_or_release_another_job ... FAILED failures: ---- deferred_work::tests::forged_running_token_cannot_credit_or_release_another_job stdout ---- thread 'deferred_work::tests::forged_running_token_cannot_credit_or_release_another_job' (41616814) panicked at src/deferred_work.rs:314:56: called `Result::unwrap_err()` on an `Ok` value: () note: run with `RUST_BACKTRACE=1` environment variable to display a backtrace failures: deferred_work::tests::forged_running_token_cannot_credit_or_release_another_job test result: FAILED. 0 passed; 1 failed; 0 ignored; 0 measured; 5 filtered out; finished in 0.00s Compiling turkos-os-deferred-work v0.1.0 (/reports/os-implementation/K981-K999-preparation-0bsVMr/mutant-missing-running-record-binding/os-deferred-work) Finished `test` profile [unoptimized + debuginfo] target(s) in 0.21s Running unittests src/lib.rs (reports/os-implementation/K981-K999-preparation-0bsVMr/mutant-missing-running-record-binding/target/debug/build/turkos-os-deferred-work/f5f2a0d501c10246/out/turkos_os_deferred_work-f5f2a0d501c10246) error: test failed, to rerun pass `--lib`