running 1 test test unterminated_string_with_missing_later_page_preserves_kernel_output ... FAILED failures: failures: unterminated_string_with_missing_later_page_preserves_kernel_output test result: FAILED. 0 passed; 1 failed; 0 ignored; 0 measured; 19 filtered out; finished in 0.00s Compiling turkos-os-page-tables v0.1.0 (/os-page-tables) Compiling turkos-os-mapping v0.1.0 (/os-mapping) Compiling turkos-os-user-copy v0.1.0 (/reports/os-implementation/K861-K879-preparation-i9HtBB/mutant-string-prefix-publication/os-user-copy) Finished `test` profile [unoptimized + debuginfo] target(s) in 0.46s Running tests/user_copy.rs (reports/os-implementation/K861-K879-preparation-i9HtBB/mutant-string-prefix-publication/target/debug/build/turkos-os-user-copy/5970609a3e73beab/out/user_copy-5970609a3e73beab) thread 'unterminated_string_with_missing_later_page_preserves_kernel_output' (41150748) panicked at tests/user_copy.rs:420:5: assertion `left == right` failed left: [75, 76, 77, 78, 79, 80, 204, 204, 204, 204, 204, 204, 204, 204, 204, 204, 204, 204, 204, 204, 204, 204, 204, 204, 204, 204, 204, 204, 204, 204, 204, 204] right: [204, 204, 204, 204, 204, 204, 204, 204, 204, 204, 204, 204, 204, 204, 204, 204, 204, 204, 204, 204, 204, 204, 204, 204, 204, 204, 204, 204, 204, 204, 204, 204] note: run with `RUST_BACKTRACE=1` environment variable to display a backtrace error: test failed, to rerun pass `--test user_copy`