running 2 tests test os_turkfs_allocation_inode_alloc_positive ... ok test os_turkfs_allocation_inode_alloc_negative ... FAILED failures: ---- os_turkfs_allocation_inode_alloc_negative stdout ---- thread 'os_turkfs_allocation_inode_alloc_negative' (50355521) panicked at /reports/os-implementation/K1635-turkfs-inode-local-fULuC8/mutant/kernel/tests/os/turkfs_allocation_inode.rs:26:5: assertion `left == right` failed left: Ok(22) right: Err(Stale) note: run with `RUST_BACKTRACE=1` environment variable to display a backtrace failures: os_turkfs_allocation_inode_alloc_negative test result: FAILED. 1 passed; 1 failed; 0 ignored; 0 measured; 0 filtered out; finished in 0.00s