running 1 test test raw_frame_bounds_are_checked_before_any_reference ... FAILED failures: ---- raw_frame_bounds_are_checked_before_any_reference stdout ---- thread 'raw_frame_bounds_are_checked_before_any_reference' (41252380) panicked at tests/exceptions.rs:170:9: assertion `left == right` failed left: Ok(FrameAddress { address: 0 }) right: Err(Frame) note: run with `RUST_BACKTRACE=1` environment variable to display a backtrace failures: raw_frame_bounds_are_checked_before_any_reference test result: FAILED. 0 passed; 1 failed; 0 ignored; 0 measured; 22 filtered out; finished in 0.00s Compiling turkos-os-exceptions v0.1.0 (/reports/os-implementation/K901-K919-preparation-EQ5mcc/mutant-unchecked-frame-pointer/os-exceptions) Finished `test` profile [unoptimized + debuginfo] target(s) in 0.27s Running tests/exceptions.rs (reports/os-implementation/K901-K919-preparation-EQ5mcc/mutant-unchecked-frame-pointer/target/debug/build/turkos-os-exceptions/75414a6222e92fd7/out/exceptions-75414a6222e92fd7) error: test failed, to rerun pass `--test exceptions`