running 2 tests test os_turkfs_namespace_rename_positive ... ok test os_turkfs_namespace_rename_negative ... FAILED failures: ---- os_turkfs_namespace_rename_negative stdout ---- thread 'os_turkfs_namespace_rename_negative' (50461036) panicked at /reports/os-implementation/K1650-turkfs-rename-local-ICkE2m/mutant/kernel/tests/os/turkfs_namespace_rename.rs:35:5: assertion `left == right` failed left: Ok(()) right: Err(Cycle) note: run with `RUST_BACKTRACE=1` environment variable to display a backtrace failures: os_turkfs_namespace_rename_negative test result: FAILED. 1 passed; 1 failed; 0 ignored; 0 measured; 0 filtered out; finished in 0.00s