running 1 test test os_shared_memory_create_negative ... FAILED failures: failures: os_shared_memory_create_negative test result: FAILED. 0 passed; 1 failed; 0 ignored; 0 measured; 2 filtered out; finished in 0.00s thread 'os_shared_memory_create_negative' (48682465) panicked at /reports/os-implementation/K1365-shared-memory-create-local-preflight-MdyJnL/workspace/kernel/tests/os/shared_memory_create.rs:32:5: assertion `left == right` failed left: Ok(()) right: Err(Access) note: run with `RUST_BACKTRACE=1` environment variable to display a backtrace