running 1 test test deferred_work::tests::submitted_coalesced_and_loss_counter_overflow_preserve_all_records ... FAILED failures: ---- deferred_work::tests::submitted_coalesced_and_loss_counter_overflow_preserve_all_records stdout ---- thread 'deferred_work::tests::submitted_coalesced_and_loss_counter_overflow_preserve_all_records' (41614133) panicked at src/deferred_work.rs:265:9: assertion `left == right` failed left: Ok(New(JobRecord { state: Queued, slot: 0, generation: 1, registration_slot: 0, registration_generation: 1, binding: Binding { device: 9, epoch: 1, owner: 7, cpu: 0 }, resource: 2, completions: 1, sequence: 1 })) right: Err(Overflow) note: run with `RUST_BACKTRACE=1` environment variable to display a backtrace failures: deferred_work::tests::submitted_coalesced_and_loss_counter_overflow_preserve_all_records test result: FAILED. 0 passed; 1 failed; 0 ignored; 0 measured; 5 filtered out; finished in 0.00s Compiling turkos-os-deferred-work v0.1.0 (/reports/os-implementation/K981-K999-preparation-0bsVMr/mutant-wrapping-submitted/os-deferred-work) Finished `test` profile [unoptimized + debuginfo] target(s) in 0.26s Running unittests src/lib.rs (reports/os-implementation/K981-K999-preparation-0bsVMr/mutant-wrapping-submitted/target/debug/build/turkos-os-deferred-work/f5f2a0d501c10246/out/turkos_os_deferred_work-f5f2a0d501c10246) error: test failed, to rerun pass `--lib`