running 1 test test os_dma_bounds_negative ... FAILED failures: ---- os_dma_bounds_negative stdout ---- thread 'os_dma_bounds_negative' (41038607) panicked at tests/dma.rs:272:9: assertion `left == right` failed left: Ok(Span { address: 42622521343, length: 2, direction: DeviceWrites }) right: Err(Bounds) note: run with `RUST_BACKTRACE=1` environment variable to display a backtrace failures: os_dma_bounds_negative test result: FAILED. 0 passed; 1 failed; 0 ignored; 0 measured; 20 filtered out; finished in 0.00s Compiling turkos-os-frame-metadata v0.1.0 (/os-frame-metadata) Compiling turkos-os-dma-memory v0.1.0 (/reports/os-implementation/K781-K799-preparation-zLhH8b/mutant-cross-page-descriptor/os-dma-memory) warning: unused variable: `end` --> src/dma.rs:440:13 | 440 | let end = offset.checked_add(length).ok_or(Error::Overflow)?; | ^^^ help: if this is intentional, prefix it with an underscore: `_end` | = note: `#[warn(unused_variables)]` (part of `#[warn(unused)]`) on by default warning: `turkos-os-dma-memory` (lib) generated 1 warning (run `cargo fix --lib -p turkos-os-dma-memory` to apply 1 suggestion) Finished `test` profile [unoptimized + debuginfo] target(s) in 0.34s Running tests/dma.rs (reports/os-implementation/K781-K799-preparation-zLhH8b/mutant-cross-page-descriptor/target/debug/build/turkos-os-dma-memory/085ed0d7ca9a8439/out/dma-085ed0d7ca9a8439) error: test failed, to rerun pass `--test dma`