running 1 test test os_frame_metadata_owner_negative ... FAILED failures: ---- os_frame_metadata_owner_negative stdout ---- thread 'os_frame_metadata_owner_negative' (40830343) panicked at tests/metadata.rs:100:5: assertion `left == right` failed left: Ok(()) right: Err(Stale) note: run with `RUST_BACKTRACE=1` environment variable to display a backtrace failures: os_frame_metadata_owner_negative test result: FAILED. 0 passed; 1 failed; 0 ignored; 0 measured; 13 filtered out; finished in 0.00s Compiling turkos-os-frame-metadata v0.1.0 (/reports/os-implementation/K721-K739-preparation-TFuAQv/mutant-stale-generation/os-frame-metadata) Finished `test` profile [unoptimized + debuginfo] target(s) in 0.22s Running tests/metadata.rs (reports/os-implementation/K721-K739-preparation-TFuAQv/mutant-stale-generation/target/debug/build/turkos-os-frame-metadata/55cb84e7a70a83e7/out/metadata-55cb84e7a70a83e7) error: test failed, to rerun pass `--test metadata`