running 1 test test os_page_faults_stack_grow_negative ... FAILED failures: failures: os_page_faults_stack_grow_negative test result: FAILED. 0 passed; 1 failed; 0 ignored; 0 measured; 22 filtered out; finished in 0.04s Compiling turkos-os-page-tables v0.1.0 (/os-page-tables) Compiling turkos-os-runtime-platform v0.1.0 (/os-runtime-platform) Compiling turkos-os-frame-metadata v0.1.0 (/os-frame-metadata) Compiling turkos-os-mapping v0.1.0 (/os-mapping) Compiling turkos-os-frame-authority v0.1.0 (/os-frame-authority) Compiling turkos-os-page-faults v0.1.0 (/reports/os-implementation/K881-K899-preparation-EmtNWF/mutant-stack-gap/os-page-faults) warning: unused variable: `resident_low` --> src/pager.rs:384:33 | 384 | RegionKind::Stack { resident_low } => { | ^^^^^^^^^^^^ help: try ignoring the field: `resident_low: _` | = note: `#[warn(unused_variables)]` (part of `#[warn(unused)]`) on by default warning: `turkos-os-page-faults` (lib) generated 1 warning (run `cargo fix --lib -p turkos-os-page-faults` to apply 1 suggestion) Finished `test` profile [unoptimized + debuginfo] target(s) in 0.56s Running tests/page_faults.rs (reports/os-implementation/K881-K899-preparation-EmtNWF/mutant-stack-gap/target/debug/build/turkos-os-page-faults/576484b42b3fefe1/out/page_faults-576484b42b3fefe1) thread 'os_page_faults_stack_grow_negative' (41240158) panicked at tests/page_faults.rs:634:9: assertion `left == right` failed left: Ok(Resolution { kind: Stack, frame: Reference(Handle { registry: 903, owner: 900, address: 1073741824, slot: 0, generation: 1 }), allocated: true, retained_cleanup: false }) right: Err(Stack) note: run with `RUST_BACKTRACE=1` environment variable to display a backtrace error: test failed, to rerun pass `--test page_faults`