running 1 test test failed_retirement_retains_same_resource_and_retry_releases_it_once ... FAILED failures: failures: failed_retirement_retains_same_resource_and_retry_releases_it_once test result: FAILED. 0 passed; 1 failed; 0 ignored; 0 measured; 25 filtered out; finished in 0.00s Compiling turkos-os-gic v0.1.0 (/reports/os-implementation/K921-K939-preparation-7Bk1ve/mutant-lost-failed-release-resource/os-gic) Finished `test` profile [unoptimized + debuginfo] target(s) in 0.39s Running tests/gic.rs (reports/os-implementation/K921-K939-preparation-7Bk1ve/mutant-lost-failed-release-resource/target/debug/build/turkos-os-gic/504a3f6ce8f6a297/out/gic-504a3f6ce8f6a297) thread 'failed_retirement_retains_same_resource_and_retry_releases_it_once' (41340416) panicked at tests/gic.rs:487:26: index out of bounds: the len is 0 but the index is 0 note: run with `RUST_BACKTRACE=1` environment variable to display a backtrace error: test failed, to rerun pass `--test gic`