running 1 test test unavailable_fatal_transport_stops_at_the_real_poll_bound ... FAILED failures: ---- unavailable_fatal_transport_stops_at_the_real_poll_bound stdout ---- thread 'unavailable_fatal_transport_stops_at_the_real_poll_bound' (41254948) panicked at tests/exceptions.rs:561:5: assertion `left == right` failed left: Emission { bytes: 0, polls: 4095, complete: false } right: Emission { bytes: 0, polls: 4096, complete: false } note: run with `RUST_BACKTRACE=1` environment variable to display a backtrace failures: unavailable_fatal_transport_stops_at_the_real_poll_bound test result: FAILED. 0 passed; 1 failed; 0 ignored; 0 measured; 22 filtered out; finished in 0.00s Compiling turkos-os-exceptions v0.1.0 (/reports/os-implementation/K901-K919-preparation-EQ5mcc/mutant-wrong-fatal-bound/os-exceptions) Finished `test` profile [unoptimized + debuginfo] target(s) in 0.27s Running tests/exceptions.rs (reports/os-implementation/K901-K919-preparation-EQ5mcc/mutant-wrong-fatal-bound/target/debug/build/turkos-os-exceptions/75414a6222e92fd7/out/exceptions-75414a6222e92fd7) error: test failed, to rerun pass `--test exceptions`