running 1 test test unaligned_stack_pointer_rejected ... FAILED failures: failures: unaligned_stack_pointer_rejected test result: FAILED. 0 passed; 1 failed; 0 ignored; 0 measured; 8 filtered out; finished in 0.00s Compiling turkos-os-entry-level v0.1.0 (/reports/os-implementation/K621-K624-T4sejM/mutant-ignore-sp-alignment/os-entry-level) Finished `test` profile [unoptimized + debuginfo] target(s) in 0.18s Running tests/level.rs (reports/os-implementation/K621-K624-T4sejM/mutant-ignore-sp-alignment/target/debug/build/turkos-os-entry-level/668801ca52b216e7/out/level-668801ca52b216e7) thread 'unaligned_stack_pointer_rejected' (39871372) panicked at tests/level.rs:51:5: assertion `left == right` failed left: Ok(Normalized { level: 1, daif_masked: 960, stack_offset: 16136 }) right: Err(StackPointer) note: run with `RUST_BACKTRACE=1` environment variable to display a backtrace error: test failed, to rerun pass `--test level`