running 1 test test aliases_cannot_combine_writable_and_executable_user_backing ... FAILED failures: failures: aliases_cannot_combine_writable_and_executable_user_backing test result: FAILED. 0 passed; 1 failed; 0 ignored; 0 measured; 14 filtered out; finished in 0.00s Compiling turkos-os-page-tables v0.1.0 (/os-page-tables) Compiling turkos-os-mapping v0.1.0 (/reports/os-implementation/K841-K859-preparation-JcE65w/mutant-protect-alias-wx/os-mapping) Finished `test` profile [unoptimized + debuginfo] target(s) in 0.36s Running tests/mapping.rs (reports/os-implementation/K841-K859-preparation-JcE65w/mutant-protect-alias-wx/target/debug/build/turkos-os-mapping/70ad7af85627c63f/out/mapping-70ad7af85627c63f) thread 'aliases_cannot_combine_writable_and_executable_user_backing' (41132856) panicked at tests/mapping.rs:239:5: assertion `left == right` failed left: Ok(()) right: Err(Permissions) note: run with `RUST_BACKTRACE=1` environment variable to display a backtrace error: test failed, to rerun pass `--test mapping`