running 2 tests test os_vfs_paths_offset_positive ... ok test os_vfs_paths_offset_negative ... FAILED failures: ---- os_vfs_paths_offset_negative stdout ---- thread 'os_vfs_paths_offset_negative' (50002094) panicked at /reports/os-implementation/K1570-vfs-offset-local-juSz5j/mutant/kernel/tests/os/vfs_offset.rs:44:5: assertion `left == right` failed left: Ok(0) right: Err(Overflow) note: run with `RUST_BACKTRACE=1` environment variable to display a backtrace failures: os_vfs_paths_offset_negative test result: FAILED. 1 passed; 1 failed; 0 ignored; 0 measured; 0 filtered out; finished in 0.00s