running 1 test test parent_exit_adopts_two_children_and_init_reaps_publication_order ... FAILED failures: ---- parent_exit_adopts_two_children_and_init_reaps_publication_order stdout ---- thread 'parent_exit_adopts_two_children_and_init_reaps_publication_order' (47539032) panicked at tests/process_table.rs:910:5: assertion `left == right` failed left: Some(ProcessId { table: 1, slot: 1, generation: 1 }) right: Some(ProcessId { table: 1, slot: 0, generation: 1 }) note: run with `RUST_BACKTRACE=1` environment variable to display a backtrace failures: parent_exit_adopts_two_children_and_init_reaps_publication_order test result: FAILED. 0 passed; 1 failed; 0 ignored; 0 measured; 31 filtered out; finished in 0.00s Compiling turkos-os-address-spaces v0.1.0 (/reports/os-implementation/K1195-orphan-local-preflight-QueAfq/mutant-workspace/os-address-spaces) Compiling turkos-os-threads v0.1.0 (/reports/os-implementation/K1195-orphan-local-preflight-QueAfq/mutant-workspace/os-threads) Compiling turkos-os-frame-metadata v0.1.0 (/reports/os-implementation/K1195-orphan-local-preflight-QueAfq/mutant-workspace/os-frame-metadata) Compiling turkos-os-process-table v0.1.0 (/reports/os-implementation/K1195-orphan-local-preflight-QueAfq/mutant-workspace/os-process-table) warning: unused variable: `init` --> src/process_table.rs:670:21 | 670 | if let Some(init) = adopt_to { | ^^^^ help: if this is intentional, prefix it with an underscore: `_init` | = note: `#[warn(unused_variables)]` (part of `#[warn(unused)]`) on by default warning: `turkos-os-process-table` (lib) generated 1 warning (run `cargo fix --lib -p turkos-os-process-table` to apply 1 suggestion) Finished `test` profile [unoptimized + debuginfo] target(s) in 0.88s Running tests/process_table.rs (reports/os-implementation/K1195-orphan-local-preflight-QueAfq/target/debug/build/turkos-os-process-table/620b408db284e488/out/process_table-620b408db284e488) error: test failed, to rerun pass `--test process_table`