running 1 test test rejected_constructor_returns_exact_backend_and_all_owned_inventory ... FAILED failures: ---- rejected_constructor_returns_exact_backend_and_all_owned_inventory stdout ---- thread 'rejected_constructor_returns_exact_backend_and_all_owned_inventory' (41612319) panicked at tests/deferred_work.rs:263:70: called `Option::unwrap()` on a `None` value note: run with `RUST_BACKTRACE=1` environment variable to display a backtrace failures: rejected_constructor_returns_exact_backend_and_all_owned_inventory test result: FAILED. 0 passed; 1 failed; 0 ignored; 0 measured; 27 filtered out; finished in 0.00s Compiling turkos-os-deferred-work v0.1.0 (/reports/os-implementation/K981-K999-preparation-0bsVMr/mutant-invalid-constructor-capacity/os-deferred-work) Finished `test` profile [unoptimized + debuginfo] target(s) in 0.48s Running tests/deferred_work.rs (reports/os-implementation/K981-K999-preparation-0bsVMr/mutant-invalid-constructor-capacity/target/debug/build/turkos-os-deferred-work/bfb4bf5e81b06a44/out/deferred_work-bfb4bf5e81b06a44) error: test failed, to rerun pass `--test deferred_work`