running 2 tests test os_partitions_view_positive ... ok test os_partitions_view_negative ... FAILED failures: ---- os_partitions_view_negative stdout ---- thread 'os_partitions_view_negative' (49836365) panicked at /reports/os-implementation/K1535-partitions-view-local-FsSWLb/mutant/kernel/tests/os/partitions_view.rs:38:9: assertion `left == right` failed left: Ok(()) right: Err(View(OutsidePartition)) note: run with `RUST_BACKTRACE=1` environment variable to display a backtrace failures: os_partitions_view_negative test result: FAILED. 1 passed; 1 failed; 0 ignored; 0 measured; 0 filtered out; finished in 0.00s