running 2 tests test os_virtio_descriptors_positive ... ok test os_virtio_descriptors_negative_and_reset ... FAILED failures: ---- os_virtio_descriptors_negative_and_reset stdout ---- thread 'os_virtio_descriptors_negative_and_reset' (49514013) panicked at /reports/os-implementation/K1485-virtio-descriptors-local-oTWrAc/mutant/kernel/tests/os/virtio_descriptors.rs:60:5: assertion `left == right` failed left: Ok(()) right: Err(WrongPhase) note: run with `RUST_BACKTRACE=1` environment variable to display a backtrace failures: os_virtio_descriptors_negative_and_reset test result: FAILED. 1 passed; 1 failed; 0 ignored; 0 measured; 0 filtered out; finished in 0.00s