running 1 test test failed_pin_release_retains_same_binding_and_refuses_reuse ... FAILED failures: failures: failed_pin_release_retains_same_binding_and_refuses_reuse test result: FAILED. 0 passed; 1 failed; 0 ignored; 0 measured; 32 filtered out; finished in 0.00s Compiling turkos-os-threads v0.1.0 (/reports/os-implementation/K1021-K1039-preparation-EkLAoy/mutant-failed-binding-dropped/os-threads) Compiling turkos-os-exceptions v0.1.0 (/reports/os-implementation/K1021-K1039-preparation-EkLAoy/mutant-failed-binding-dropped/os-exceptions) Compiling turkos-os-context-switch v0.1.0 (/reports/os-implementation/K1021-K1039-preparation-EkLAoy/mutant-failed-binding-dropped/os-context-switch) Finished `test` profile [unoptimized + debuginfo] target(s) in 0.41s Running tests/context.rs (reports/os-implementation/K1021-K1039-preparation-EkLAoy/mutant-failed-binding-dropped/target/debug/build/turkos-os-context-switch/ecc45bab67ed6713/out/context-ecc45bab67ed6713) thread 'failed_pin_release_retains_same_binding_and_refuses_reuse' (41794908) panicked at tests/context.rs:496:5: assertion `left == right` failed left: 1 right: 2 note: run with `RUST_BACKTRACE=1` environment variable to display a backtrace error: test failed, to rerun pass `--test context`