running 1 test test readonly_or_stale_frame_pin_never_grants_write ... FAILED failures: failures: readonly_or_stale_frame_pin_never_grants_write test result: FAILED. 0 passed; 1 failed; 0 ignored; 0 measured; 14 filtered out; finished in 0.00s Compiling turkos-os-page-tables v0.1.0 (/os-page-tables) Compiling turkos-os-mapping v0.1.0 (/reports/os-implementation/K841-K859-preparation-JcE65w/mutant-readonly-write-pin/os-mapping) warning: unused variable: `write` --> src/mapping.rs:385:9 | 385 | write: bool, | ^^^^^ help: if this is intentional, prefix it with an underscore: `_write` | = note: `#[warn(unused_variables)]` (part of `#[warn(unused)]`) on by default warning: `turkos-os-mapping` (lib) generated 1 warning (run `cargo fix --lib -p turkos-os-mapping` to apply 1 suggestion) Finished `test` profile [unoptimized + debuginfo] target(s) in 0.37s Running tests/mapping.rs (reports/os-implementation/K841-K859-preparation-JcE65w/mutant-readonly-write-pin/target/debug/build/turkos-os-mapping/70ad7af85627c63f/out/mapping-70ad7af85627c63f) thread 'readonly_or_stale_frame_pin_never_grants_write' (41133502) panicked at tests/mapping.rs:314:5: assertion `left == right` failed left: None right: Some(Permissions) note: run with `RUST_BACKTRACE=1` environment variable to display a backtrace error: test failed, to rerun pass `--test mapping`