running 1 test test after_switch_retains_both_bindings_prepared_and_source_capture ... FAILED failures: failures: after_switch_retains_both_bindings_prepared_and_source_capture test result: FAILED. 0 passed; 1 failed; 0 ignored; 0 measured; 32 filtered out; finished in 0.00s Compiling turkos-os-exceptions v0.1.0 (/reports/os-implementation/K1021-K1039-preparation-EkLAoy/mutant-uncertain-capture-dropped/os-exceptions) Compiling turkos-os-threads v0.1.0 (/reports/os-implementation/K1021-K1039-preparation-EkLAoy/mutant-uncertain-capture-dropped/os-threads) Compiling turkos-os-context-switch v0.1.0 (/reports/os-implementation/K1021-K1039-preparation-EkLAoy/mutant-uncertain-capture-dropped/os-context-switch) Finished `test` profile [unoptimized + debuginfo] target(s) in 0.42s Running tests/context.rs (reports/os-implementation/K1021-K1039-preparation-EkLAoy/mutant-uncertain-capture-dropped/target/debug/build/turkos-os-context-switch/3d0fd20e434eb716/out/context-3d0fd20e434eb716) thread 'after_switch_retains_both_bindings_prepared_and_source_capture' (41794675) panicked at tests/context.rs:199:5: assertion failed: s.faulted && s.retained_switch && s.retained_capture note: run with `RUST_BACKTRACE=1` environment variable to display a backtrace error: test failed, to rerun pass `--test context`