running 1 test test missing_accessflag_and_unknown_mair_slot_are_refused ... FAILED failures: failures: missing_accessflag_and_unknown_mair_slot_are_refused test result: FAILED. 0 passed; 1 failed; 0 ignored; 0 measured; 9 filtered out; finished in 0.00s Compiling turkos-os-runtime-platform v0.1.0 (/os-runtime-platform) Compiling turkos-os-frame-metadata v0.1.0 (/os-frame-metadata) Compiling turkos-os-page-tables v0.1.0 (/reports/os-implementation/K801-K819-bFalcS/mutant-unknown-mair/os-page-tables) Compiling turkos-os-frame-authority v0.1.0 (/os-frame-authority) Finished `test` profile [unoptimized + debuginfo] target(s) in 0.42s Running tests/descriptor.rs (reports/os-implementation/K801-K819-bFalcS/mutant-unknown-mair/target/debug/build/turkos-os-page-tables/b64cd06aa99d6d91/out/descriptor-b64cd06aa99d6d91) thread 'missing_accessflag_and_unknown_mair_slot_are_refused' (41100872) panicked at tests/descriptor.rs:248:5: assertion `left == right` failed left: Ok(Page { address: 1073741824, memory: Normal, permissions: Permissions { user: true, write: false, execute: true } }) right: Err(UnsupportedBits(8)) note: run with `RUST_BACKTRACE=1` environment variable to display a backtrace error: test failed, to rerun pass `--test descriptor`