running 2 tests test os_vfs_paths_dup_positive ... ok test os_vfs_paths_dup_negative ... FAILED failures: ---- os_vfs_paths_dup_negative stdout ---- thread 'os_vfs_paths_dup_negative' (50056234) panicked at /reports/os-implementation/K1580-vfs-dup-local-8WVyHz/mutant/kernel/tests/os/vfs_dup.rs:36:5: assertion `left == right` failed left: (0, 1, false) right: (0, 1, true) note: run with `RUST_BACKTRACE=1` environment variable to display a backtrace failures: os_vfs_paths_dup_negative test result: FAILED. 1 passed; 1 failed; 0 ignored; 0 measured; 0 filtered out; finished in 0.00s