running 1 test test ordinary_free_is_refused_before_and_after_host_protocol_completion ... FAILED failures: ---- ordinary_free_is_refused_before_and_after_host_protocol_completion stdout ---- thread 'ordinary_free_is_refused_before_and_after_host_protocol_completion' (41039753) panicked at tests/dma.rs:362:72: called `Result::unwrap_err()` on an `Ok` value: () note: run with `RUST_BACKTRACE=1` environment variable to display a backtrace failures: ordinary_free_is_refused_before_and_after_host_protocol_completion test result: FAILED. 0 passed; 1 failed; 0 ignored; 0 measured; 20 filtered out; finished in 0.00s Compiling turkos-os-frame-metadata v0.1.0 (/os-frame-metadata) Compiling turkos-os-dma-memory v0.1.0 (/reports/os-implementation/K781-K799-preparation-zLhH8b/mutant-active-unpin/os-dma-memory) warning: unused variable: `state` --> src/dma.rs:629:13 | 629 | let state = self.record(ticket, self.workspace.binding)?.state; | ^^^^^ help: if this is intentional, prefix it with an underscore: `_state` | = note: `#[warn(unused_variables)]` (part of `#[warn(unused)]`) on by default warning: `turkos-os-dma-memory` (lib) generated 1 warning (run `cargo fix --lib -p turkos-os-dma-memory` to apply 1 suggestion) Finished `test` profile [unoptimized + debuginfo] target(s) in 0.33s Running tests/dma.rs (reports/os-implementation/K781-K799-preparation-zLhH8b/mutant-active-unpin/target/debug/build/turkos-os-dma-memory/085ed0d7ca9a8439/out/dma-085ed0d7ca9a8439) error: test failed, to rerun pass `--test dma`