running 2 tests test os_pci_discovery_capabilities_positive ... ok test os_pci_discovery_capabilities_negative ... FAILED failures: ---- os_pci_discovery_capabilities_negative stdout ---- thread 'os_pci_discovery_capabilities_negative' (49094510) panicked at /reports/os-implementation/K1435-pci-capabilities-local-VThJKr/mutant/kernel/tests/os/pci_capabilities.rs:53:5: assertion `left == right` failed left: Err(Full) right: Err(Cycle) note: run with `RUST_BACKTRACE=1` environment variable to display a backtrace failures: os_pci_discovery_capabilities_negative test result: FAILED. 1 passed; 1 failed; 0 ignored; 0 measured; 0 filtered out; finished in 0.00s