running 1 test test os_service_registry_versions_negative ... FAILED failures: failures: os_service_registry_versions_negative test result: FAILED. 0 passed; 1 failed; 0 ignored; 0 measured; 4 filtered out; finished in 0.00s thread 'os_service_registry_versions_negative' (48845357) panicked at /reports/os-implementation/K1390-service-registry-versions-local-preflight-WPbHaH/workspace/userspace/tests/service_registry.rs:124:5: assertion `left == right` failed left: Ok(17) right: Err(Version) note: run with `RUST_BACKTRACE=1` environment variable to display a backtrace