running 1 test test os_kernel_heap_pressure_negative ... FAILED failures: ---- os_kernel_heap_pressure_negative stdout ---- thread 'os_kernel_heap_pressure_negative' (40963694) panicked at tests/heap.rs:206:9: assertion `left == right` failed left: Ok(Handle { heap: 1, slot: 1, generation: 1, owner: 1, address: 1073741856 }) right: Err(WouldBlock) note: run with `RUST_BACKTRACE=1` environment variable to display a backtrace failures: os_kernel_heap_pressure_negative test result: FAILED. 0 passed; 1 failed; 0 ignored; 0 measured; 12 filtered out; finished in 0.00s Compiling turkos-os-kernel-heap v0.1.0 (/reports/os-implementation/K761-K779-preparation-KNIrm3/mutant-irq-allocator/os-kernel-heap) warning: unused variable: `context` --> src/heap.rs:259:16 | 259 | fn context(context: Context) -> Result<(), Error> { | ^^^^^^^ help: if this is intentional, prefix it with an underscore: `_context` | = note: `#[warn(unused_variables)]` (part of `#[warn(unused)]`) on by default warning: `turkos-os-kernel-heap` (lib) generated 1 warning (run `cargo fix --lib -p turkos-os-kernel-heap` to apply 1 suggestion) Finished `test` profile [unoptimized + debuginfo] target(s) in 0.30s Running tests/heap.rs (reports/os-implementation/K761-K779-preparation-KNIrm3/mutant-irq-allocator/target/debug/build/turkos-os-kernel-heap/04dbad547e5317ad/out/heap-04dbad547e5317ad) error: test failed, to rerun pass `--test heap`