running 1 test test os_init_restart_failure_retains_owner_and_exhausts_budget ... FAILED failures: ---- os_init_restart_failure_retains_owner_and_exhausts_budget stdout ---- thread 'os_init_restart_failure_retains_owner_and_exhausts_budget' (48069712) panicked at tests/restart.rs:86:5: assertion `left == right` failed left: 1 right: 0 note: run with `RUST_BACKTRACE=1` environment variable to display a backtrace failures: os_init_restart_failure_retains_owner_and_exhausts_budget test result: FAILED. 0 passed; 1 failed; 0 ignored; 0 measured; 2 filtered out; finished in 0.00s Compiling turkos-os-init-restart v0.1.0 (/reports/os-implementation/K1255-restart-local-preflight-ohDsN9/workspace/os-init-restart) Finished `test` profile [unoptimized + debuginfo] target(s) in 0.12s Running tests/restart.rs (reports/os-implementation/K1255-restart-local-preflight-ohDsN9/target/debug/build/turkos-os-init-restart/ccc4b7d4625eaead/out/restart-ccc4b7d4625eaead) error: test failed, to rerun pass `--test restart`