running 1 test test origin_negative_wrong_address_labels_are_rejected ... FAILED failures: failures: origin_negative_wrong_address_labels_are_rejected test result: FAILED. 0 passed; 1 failed; 0 ignored; 0 measured; 17 filtered out; finished in 0.00s Compiling typenum v1.20.1 Compiling libc v0.2.190 Compiling cfg-if v1.0.5 Compiling turkos-bootinfo v0.0.1 (/reports/os-implementation/K601-K604-bSl4iH/ignores-header-address/bootinfo) Compiling hybrid-array v0.4.15 Compiling block-buffer v0.12.1 Compiling crypto-common v0.2.2 Compiling cpufeatures v0.3.1 Compiling digest v0.11.3 Compiling sha2 v0.11.0 Compiling turkos-kernel v0.0.1 (/reports/os-implementation/K601-K604-bSl4iH/ignores-header-address/kernel) Compiling turkos-os-runtime v0.0.1 (/reports/os-implementation/K601-K604-bSl4iH/ignores-header-address/os-runtime) Finished `test` profile [unoptimized + debuginfo] target(s) in 1.60s Running tests/boot_contract.rs (reports/os-implementation/K601-K604-bSl4iH/ignores-header-address/target/debug/build/turkos-os-runtime/ba39b366837f3bb6/out/boot_contract-ba39b366837f3bb6) thread 'origin_negative_wrong_address_labels_are_rejected' (39417566) panicked at tests/boot_contract.rs:216:10: called `Result::unwrap_err()` on an `Ok` value: ResolvedBoot { origin: UefiBootInfoV1, ram: PhysicalRange { start: 1073741824, end: 1610612736 }, dtb: PhysicalRange { start: 1608515584, end: 1608515902 }, uart_base: 150994944, boot_info: Some(BootInfoV1 { magic: [84, 85, 82, 75, 79, 83, 66, 73], version: 1, struct_bytes: 72, memory_map_ptr: 1078984704, memory_map_bytes: 48, descriptor_bytes: 48, descriptor_version: 1, kernel_phys_start: 1074266112, kernel_file_bytes: 131072, dtb_phys_addr: 1608515584, flags: 0 }) } note: run with `RUST_BACKTRACE=1` environment variable to display a backtrace error: test failed, to rerun pass `--test boot_contract`