running 1 test test detach_and_complete_tlbi_precede_each_intermediate_reclaim ... FAILED failures: failures: detach_and_complete_tlbi_precede_each_intermediate_reclaim test result: FAILED. 0 passed; 1 failed; 0 ignored; 0 measured; 13 filtered out; finished in 0.01s Compiling turkos-os-runtime-platform v0.1.0 (/os-runtime-platform) Compiling turkos-os-page-tables v0.1.0 (/reports/os-implementation/K801-K819-bFalcS/mutant-omit-tlbi/os-page-tables) Compiling turkos-os-frame-metadata v0.1.0 (/os-frame-metadata) Compiling turkos-os-frame-authority v0.1.0 (/os-frame-authority) Finished `test` profile [unoptimized + debuginfo] target(s) in 0.54s Running tests/tree.rs (reports/os-implementation/K801-K819-bFalcS/mutant-omit-tlbi/target/debug/build/turkos-os-page-tables/351e0aca2c5181f2/out/tree-351e0aca2c5181f2) thread 'detach_and_complete_tlbi_precede_each_intermediate_reclaim' (41102550) panicked at tests/tree.rs:370:13: assertion `left == right` failed left: [Tlbi(1073741824, Some(2147483648)), Dsb, Isb, Store(1073754112, 0, 0)] right: [Dsb, Tlbi(1073741824, None), Dsb, Isb] note: run with `RUST_BACKTRACE=1` environment variable to display a backtrace error: test failed, to rerun pass `--test tree`