running 2 tests test os_turkfs_allocation_bitmap_positive ... ok test os_turkfs_allocation_bitmap_negative ... FAILED failures: ---- os_turkfs_allocation_bitmap_negative stdout ---- thread 'os_turkfs_allocation_bitmap_negative' (50282355) panicked at /reports/os-implementation/K1625-turkfs-allocation-local-I5hjuB/mutant/kernel/tests/os/turkfs_allocation.rs:26:5: assertion `left == right` failed left: Ok(Bitmap { capacity: 64, reserved: 31, allocated: 18446744073709551611 }) right: Err(ReservedFree) note: run with `RUST_BACKTRACE=1` environment variable to display a backtrace failures: os_turkfs_allocation_bitmap_negative test result: FAILED. 1 passed; 1 failed; 0 ignored; 0 measured; 0 filtered out; finished in 0.00s