running 1 test test second_table_enospc_publishes_no_prefix_and_returns_exact_inventory ... FAILED failures: failures: second_table_enospc_publishes_no_prefix_and_returns_exact_inventory test result: FAILED. 0 passed; 1 failed; 0 ignored; 0 measured; 13 filtered out; finished in 0.00s Compiling turkos-os-runtime-platform v0.1.0 (/os-runtime-platform) Compiling turkos-os-page-tables v0.1.0 (/reports/os-implementation/K801-K819-bFalcS/mutant-rollback-leak/os-page-tables) Compiling turkos-os-frame-metadata v0.1.0 (/os-frame-metadata) warning: unused variable: `record` --> src/tree.rs:291:17 | 291 | let record = self.records[slot].unwrap(); | ^^^^^^ help: if this is intentional, prefix it with an underscore: `_record` | = note: `#[warn(unused_variables)]` (part of `#[warn(unused)]`) on by default warning: `turkos-os-page-tables` (lib) generated 1 warning (run `cargo fix --lib -p turkos-os-page-tables` to apply 1 suggestion) Compiling turkos-os-frame-authority v0.1.0 (/os-frame-authority) Finished `test` profile [unoptimized + debuginfo] target(s) in 0.54s Running tests/tree.rs (reports/os-implementation/K801-K819-bFalcS/mutant-rollback-leak/target/debug/build/turkos-os-page-tables/351e0aca2c5181f2/out/tree-351e0aca2c5181f2) thread 'second_table_enospc_publishes_no_prefix_and_returns_exact_inventory' (41101197) panicked at tests/tree.rs:285:5: assertion `left == right` failed left: Err(Retained) right: Err(NoMemory) note: run with `RUST_BACKTRACE=1` environment variable to display a backtrace error: test failed, to rerun pass `--test tree`