running 2 tests test os_turkfs_namespace_unlink_negative ... FAILED test os_turkfs_namespace_unlink_positive ... FAILED failures: ---- os_turkfs_namespace_unlink_negative stdout ---- thread 'os_turkfs_namespace_unlink_negative' (50483659) panicked at /reports/os-implementation/K1655-turkfs-unlink-local-CRwxw2/mutant/kernel/tests/os/turkfs_namespace_unlink.rs:51:5: assertion `left != right` failed left: 0 right: 0 note: run with `RUST_BACKTRACE=1` environment variable to display a backtrace ---- os_turkfs_namespace_unlink_positive stdout ---- thread 'os_turkfs_namespace_unlink_positive' (50483660) panicked at /reports/os-implementation/K1655-turkfs-unlink-local-CRwxw2/mutant/kernel/tests/os/turkfs_namespace_unlink.rs:23:5: assertion `left == right` failed left: 0 right: 1074791424 failures: os_turkfs_namespace_unlink_negative os_turkfs_namespace_unlink_positive test result: FAILED. 0 passed; 2 failed; 0 ignored; 0 measured; 0 filtered out; finished in 0.00s