running 1 test test nesting_capacity_refusal_changes_neither_tokens_nor_snapshot ... FAILED failures: ---- nesting_capacity_refusal_changes_neither_tokens_nor_snapshot stdout ---- thread 'nesting_capacity_refusal_changes_neither_tokens_nor_snapshot' (41253524) panicked at src/exceptions.rs:471:9: index out of bounds: the len is 2 but the index is 2 note: run with `RUST_BACKTRACE=1` environment variable to display a backtrace failures: nesting_capacity_refusal_changes_neither_tokens_nor_snapshot test result: FAILED. 0 passed; 1 failed; 0 ignored; 0 measured; 22 filtered out; finished in 0.00s Compiling turkos-os-exceptions v0.1.0 (/reports/os-implementation/K901-K919-preparation-EQ5mcc/mutant-unbounded-nesting/os-exceptions) Finished `test` profile [unoptimized + debuginfo] target(s) in 0.25s Running tests/exceptions.rs (reports/os-implementation/K901-K919-preparation-EQ5mcc/mutant-unbounded-nesting/target/debug/build/turkos-os-exceptions/75414a6222e92fd7/out/exceptions-75414a6222e92fd7) error: test failed, to rerun pass `--test exceptions`