running 2 tests test os_turkfs_recovery_second_cut_negative ... ok test os_turkfs_recovery_second_cut_positive ... FAILED failures: ---- os_turkfs_recovery_second_cut_positive stdout ---- thread 'os_turkfs_recovery_second_cut_positive' (50724141) panicked at /reports/os-implementation/K1690-turkfs-second-cut-local-1TV2Ts/mutant/kernel/tests/os/turkfs_recovery_second_cut.rs:65:21: assertion `left == right` failed left: Ok(Replayed { writes: 3 }) right: Ok(AlreadyApplied) note: run with `RUST_BACKTRACE=1` environment variable to display a backtrace failures: os_turkfs_recovery_second_cut_positive test result: FAILED. 1 passed; 1 failed; 0 ignored; 0 measured; 0 filtered out; finished in 0.00s