running 1 test test wrong_cpu_irq_or_unmasked_context_never_changes_thread_state ... FAILED failures: failures: wrong_cpu_irq_or_unmasked_context_never_changes_thread_state test result: FAILED. 0 passed; 1 failed; 0 ignored; 0 measured; 21 filtered out; finished in 0.00s Compiling turkos-os-threads v0.1.0 (/reports/os-implementation/K1001-K1019-preparation-Vy7GRN/mutant-irq-context-ignored/os-threads) Finished `test` profile [unoptimized + debuginfo] target(s) in 0.41s Running tests/threads.rs (reports/os-implementation/K1001-K1019-preparation-Vy7GRN/mutant-irq-context-ignored/target/debug/build/turkos-os-threads/fc0d96e38d2f6d6f/out/threads-fc0d96e38d2f6d6f) thread 'wrong_cpu_irq_or_unmasked_context_never_changes_thread_state' (41561050) panicked at tests/threads.rs:430:9: assertion `left == right` failed left: Ok(()) right: Err(Context) note: run with `RUST_BACKTRACE=1` environment variable to display a backtrace error: test failed, to rerun pass `--test threads`