running 1 test test os_kernel_heap_release_positive ... FAILED failures: ---- os_kernel_heap_release_positive stdout ---- thread 'os_kernel_heap_release_positive' (40963206) panicked at tests/heap.rs:156:5: assertion `left == right` failed left: Err(ForeignHandle) right: Err(StaleHandle) note: run with `RUST_BACKTRACE=1` environment variable to display a backtrace failures: os_kernel_heap_release_positive test result: FAILED. 0 passed; 1 failed; 0 ignored; 0 measured; 12 filtered out; finished in 0.00s Compiling turkos-os-kernel-heap v0.1.0 (/reports/os-implementation/K761-K779-preparation-KNIrm3/mutant-stale-generation/os-kernel-heap) Finished `test` profile [unoptimized + debuginfo] target(s) in 0.30s Running tests/heap.rs (reports/os-implementation/K761-K779-preparation-KNIrm3/mutant-stale-generation/target/debug/build/turkos-os-kernel-heap/04dbad547e5317ad/out/heap-04dbad547e5317ad) error: test failed, to rerun pass `--test heap`