running 2 tests test os_turkfs_recovery_replay_negative ... ok test os_turkfs_recovery_replay_positive ... FAILED failures: ---- os_turkfs_recovery_replay_positive stdout ---- thread 'os_turkfs_recovery_replay_positive' (50627011) panicked at /reports/os-implementation/K1685-turkfs-replay-local-OwC1Nl/mutant/kernel/tests/os/turkfs_recovery_replay.rs:43:9: assertion `left == right` failed left: Ok(Replayed { writes: 3 }) right: Ok(AlreadyApplied) note: run with `RUST_BACKTRACE=1` environment variable to display a backtrace failures: os_turkfs_recovery_replay_positive test result: FAILED. 1 passed; 1 failed; 0 ignored; 0 measured; 0 filtered out; finished in 0.00s