running 2 tests test os_vfs_traits_negative ... ok test os_vfs_traits_positive ... FAILED failures: ---- os_vfs_traits_positive stdout ---- thread 'os_vfs_traits_positive' (50089278) panicked at /reports/os-implementation/K1585-vfs-traits-local-zKQvPr/mutant/kernel/tests/os/vfs_traits.rs:88:5: assertion `left == right` failed left: Ok(Metadata { inode: 2, kind: Regular, size: 5, allocated_bytes: 512, read_only: true }) right: Err(Stale) note: run with `RUST_BACKTRACE=1` environment variable to display a backtrace failures: os_vfs_traits_positive test result: FAILED. 1 passed; 1 failed; 0 ignored; 0 measured; 0 filtered out; finished in 0.00s