running 1 test test os_init_manifest_rejects_identity_image_and_abi_errors ... FAILED failures: ---- os_init_manifest_rejects_identity_image_and_abi_errors stdout ---- thread 'os_init_manifest_rejects_identity_image_and_abi_errors' (48023808) panicked at tests/manifest.rs:31:5: assertion failed: matches!(Manifest::new([entry(1, 1, 1, 1, 0), entry(1, 2, 1, 1, 0)], budget).validate(), Err(Error::Duplicate {first: 0, second: 1})) note: run with `RUST_BACKTRACE=1` environment variable to display a backtrace failures: os_init_manifest_rejects_identity_image_and_abi_errors test result: FAILED. 0 passed; 1 failed; 0 ignored; 0 measured; 2 filtered out; finished in 0.00s Compiling turkos-os-init-manifest v0.1.0 (/reports/os-implementation/K1245-manifest-local-preflight-3dJV2x/workspace/os-init-manifest) Finished `test` profile [unoptimized + debuginfo] target(s) in 0.12s Running tests/manifest.rs (reports/os-implementation/K1245-manifest-local-preflight-3dJV2x/target/debug/build/turkos-os-init-manifest/a9b7371717d87083/out/manifest-a9b7371717d87083) error: test failed, to rerun pass `--test manifest`