running 1 test test foreign_queue_handle_and_active_priority_change_refuse ... FAILED failures: failures: foreign_queue_handle_and_active_priority_change_refuse test result: FAILED. 0 passed; 1 failed; 0 ignored; 0 measured; 21 filtered out; finished in 0.00s Compiling turkos-os-exceptions v0.1.0 (/reports/os-implementation/K1041-K1059-preparation-5hOulI/mutant-foreign-queue/os-exceptions) Compiling turkos-os-threads v0.1.0 (/reports/os-implementation/K1041-K1059-preparation-5hOulI/mutant-foreign-queue/os-threads) Compiling turkos-os-context-switch v0.1.0 (/reports/os-implementation/K1041-K1059-preparation-5hOulI/mutant-foreign-queue/os-context-switch) Compiling turkos-os-runqueue v0.1.0 (/reports/os-implementation/K1041-K1059-preparation-5hOulI/mutant-foreign-queue/os-runqueue) Finished `test` profile [unoptimized + debuginfo] target(s) in 0.68s Running tests/runqueue.rs (reports/os-implementation/K1041-K1059-preparation-5hOulI/mutant-foreign-queue/target/debug/build/turkos-os-runqueue/95a9ed8932727afc/out/runqueue-95a9ed8932727afc) thread 'foreign_queue_handle_and_active_priority_change_refuse' (41914323) panicked at tests/runqueue.rs:334:5: assertion `left == right` failed left: Ok(()) right: Err(Stale) note: run with `RUST_BACKTRACE=1` environment variable to display a backtrace error: test failed, to rerun pass `--test runqueue`