running 1 test test os_runqueue_priority_negative ... FAILED failures: failures: os_runqueue_priority_negative test result: FAILED. 0 passed; 1 failed; 0 ignored; 0 measured; 21 filtered out; finished in 0.00s Compiling turkos-os-threads v0.1.0 (/reports/os-implementation/K1041-K1059-preparation-5hOulI/mutant-priority-IRQ-request-admitted/os-threads) Compiling turkos-os-exceptions v0.1.0 (/reports/os-implementation/K1041-K1059-preparation-5hOulI/mutant-priority-IRQ-request-admitted/os-exceptions) Compiling turkos-os-context-switch v0.1.0 (/reports/os-implementation/K1041-K1059-preparation-5hOulI/mutant-priority-IRQ-request-admitted/os-context-switch) Compiling turkos-os-runqueue v0.1.0 (/reports/os-implementation/K1041-K1059-preparation-5hOulI/mutant-priority-IRQ-request-admitted/os-runqueue) Finished `test` profile [unoptimized + debuginfo] target(s) in 0.67s Running tests/runqueue.rs (reports/os-implementation/K1041-K1059-preparation-5hOulI/mutant-priority-IRQ-request-admitted/target/debug/build/turkos-os-runqueue/fefc04a6188007be/out/runqueue-fefc04a6188007be) thread 'os_runqueue_priority_negative' (41915340) panicked at tests/runqueue.rs:146:5: assertion `left == right` failed left: Ok(()) right: Err(Priority) note: run with `RUST_BACKTRACE=1` environment variable to display a backtrace error: test failed, to rerun pass `--test runqueue`