running 1 test test source_return_failure_retains_nonclone_registration_and_exact_pin_until_retry ... FAILED failures: ---- source_return_failure_retains_nonclone_registration_and_exact_pin_until_retry stdout ---- thread 'source_return_failure_retains_nonclone_registration_and_exact_pin_until_retry' (41615499) panicked at tests/deferred_work.rs:652:15: called `Result::unwrap()` on an `Err` value: Binding note: run with `RUST_BACKTRACE=1` environment variable to display a backtrace failures: source_return_failure_retains_nonclone_registration_and_exact_pin_until_retry test result: FAILED. 0 passed; 1 failed; 0 ignored; 0 measured; 27 filtered out; finished in 0.00s Compiling turkos-os-deferred-work v0.1.0 (/reports/os-implementation/K981-K999-preparation-0bsVMr/mutant-source-return-lost-owner/os-deferred-work) Finished `test` profile [unoptimized + debuginfo] target(s) in 0.48s Running tests/deferred_work.rs (reports/os-implementation/K981-K999-preparation-0bsVMr/mutant-source-return-lost-owner/target/debug/build/turkos-os-deferred-work/bfb4bf5e81b06a44/out/deferred_work-bfb4bf5e81b06a44) error: test failed, to rerun pass `--test deferred_work`