running 1 test test os_boot_contract_header_negative ... FAILED failures: failures: os_boot_contract_header_negative test result: FAILED. 0 passed; 1 failed; 0 ignored; 0 measured; 8 filtered out; finished in 0.00s Compiling turkos-bootinfo v0.0.1 (/reports/os-implementation/K606-K609-dHreLg/mutant-read-body-first/bootinfo) Compiling turkos-os-boot-header v0.0.1 (/reports/os-implementation/K606-K609-dHreLg/mutant-read-body-first/os-boot-header) Finished `test` profile [unoptimized + debuginfo] target(s) in 0.28s Running tests/boot_header.rs (reports/os-implementation/K606-K609-dHreLg/mutant-read-body-first/target/debug/build/turkos-os-boot-header/828df12f75be035a/out/boot_header-828df12f75be035a) thread 'os_boot_contract_header_negative' (39827556) panicked at tests/boot_header.rs:76:9: assertion `left == right` failed left: Err(BodyTruncated) right: Err(PrefixTruncated) note: run with `RUST_BACKTRACE=1` environment variable to display a backtrace error: test failed, to rerun pass `--test boot_header`