running 1 test test context::exhaustion_tests::dispatch_epoch_exhaustion_preserves_active_context_and_resources ... FAILED failures: failures: context::exhaustion_tests::dispatch_epoch_exhaustion_preserves_active_context_and_resources test result: FAILED. 0 passed; 1 failed; 0 ignored; 0 measured; 4 filtered out; finished in 0.00s Compiling turkos-os-exceptions v0.1.0 (/reports/os-implementation/K1021-K1039-preparation-EkLAoy/mutant-dispatch-epoch-wrapped/os-exceptions) Compiling turkos-os-threads v0.1.0 (/reports/os-implementation/K1021-K1039-preparation-EkLAoy/mutant-dispatch-epoch-wrapped/os-threads) Compiling turkos-os-context-switch v0.1.0 (/reports/os-implementation/K1021-K1039-preparation-EkLAoy/mutant-dispatch-epoch-wrapped/os-context-switch) Finished `test` profile [unoptimized + debuginfo] target(s) in 0.33s Running unittests src/lib.rs (reports/os-implementation/K1021-K1039-preparation-EkLAoy/mutant-dispatch-epoch-wrapped/target/debug/build/turkos-os-context-switch/13a78548d5c60a24/out/turkos_os_context_switch-13a78548d5c60a24) thread 'context::exhaustion_tests::dispatch_epoch_exhaustion_preserves_active_context_and_resources' (41795126) panicked at src/context.rs:1235:9: assertion failed: matches!(bank.cooperate(a, b, c), Err(Error::Exhausted)) note: run with `RUST_BACKTRACE=1` environment variable to display a backtrace error: test failed, to rerun pass `--lib`