running 1 test test os_buddy_orders_negative ... FAILED failures: failures: os_buddy_orders_negative test result: FAILED. 0 passed; 1 failed; 0 ignored; 0 measured; 17 filtered out; finished in 0.00s Compiling turkos-os-runtime-platform v0.1.0 (/os-runtime-platform) Compiling turkos-os-frame-authority v0.1.0 (/os-frame-authority) Compiling turkos-os-buddy-frames v0.1.0 (/reports/os-implementation/K741-K759-7jBhgr/mutant-unaligned-block/os-buddy-frames) Finished `test` profile [unoptimized + debuginfo] target(s) in 0.46s Running tests/buddy.rs (reports/os-implementation/K741-K759-7jBhgr/mutant-unaligned-block/target/debug/build/turkos-os-buddy-frames/aed4ac960f5fbb7a/out/buddy-aed4ac960f5fbb7a) thread 'os_buddy_orders_negative' (41023737) panicked at tests/buddy.rs:63:5: assertion failed: matches!(buddy.acquire_at(BASE + PAGE, 2), Err(Error::Misaligned)) note: run with `RUST_BACKTRACE=1` environment variable to display a backtrace error: test failed, to rerun pass `--test buddy`