running 1 test test os_core_tools_process_view_negative ... FAILED failures: ---- os_core_tools_process_view_negative stdout ---- thread 'os_core_tools_process_view_negative' (48336848) panicked at tests/core_tools.rs:500:5: assertion failed: matches!(Ps::::open(&mut backend, Request::RequestAddress(0xffff_0000_0000_1000)), Err(ProcessError::Access)) note: run with `RUST_BACKTRACE=1` environment variable to display a backtrace failures: os_core_tools_process_view_negative test result: FAILED. 0 passed; 1 failed; 0 ignored; 0 measured; 15 filtered out; finished in 0.00s Compiling turkos-userspace v0.1.0 (/reports/os-implementation/K1300-process-view-local-preflight-q5OkzA/workspace/userspace) Finished `test` profile [unoptimized + debuginfo] target(s) in 0.16s Running tests/core_tools.rs (reports/os-implementation/K1300-process-view-local-preflight-q5OkzA/target/debug/build/turkos-userspace/8daf7d439cc9c8af/out/core_tools-8daf7d439cc9c8af) error: test failed, to rerun pass `--test core_tools`