running 2 tests test os_virtqueue_completion_out_of_order ... ok test os_virtqueue_completion_rejections_and_reset ... FAILED failures: ---- os_virtqueue_completion_rejections_and_reset stdout ---- thread 'os_virtqueue_completion_rejections_and_reset' (49589220) panicked at /reports/os-implementation/K1495-virtio-completions-local-7TNfV4/mutant/kernel/tests/os/virtio_completions.rs:32:5: assertion `left == right` failed left: Ok(Completion { handle: Handle { head: 2, generation: 1, owner: 16384 }, used_length: 513, status: 3 }) right: Err(InvalidStatus) note: run with `RUST_BACKTRACE=1` environment variable to display a backtrace failures: os_virtqueue_completion_rejections_and_reset test result: FAILED. 1 passed; 1 failed; 0 ignored; 0 measured; 0 filtered out; finished in 0.00s