running 1 test test os_service_registry_names_negative ... FAILED failures: failures: os_service_registry_names_negative test result: FAILED. 0 passed; 1 failed; 0 ignored; 0 measured; 2 filtered out; finished in 0.00s thread 'os_service_registry_names_negative' (48813846) panicked at /reports/os-implementation/K1385-service-registry-names-local-preflight-XybFwq/workspace/userspace/tests/service_registry.rs:41:5: assertion `left == right` failed left: Ok(Binding { name: Name { bytes: [99, 111, 110, 115, 111, 108, 101, 0, 0, 0, 0, 0, 0, 0, 0, 0, 0, 0, 0, 0, 0, 0, 0, 0], len: 7 }, publisher: PublisherId { slot: 2, generation: 11 }, endpoint: 153 }) right: Err(Access) note: run with `RUST_BACKTRACE=1` environment variable to display a backtrace